Target
Amine oxidase [flavin-containing] B
Ligand
BDBM256656
Substrate
Meas. Tech.
MAO-B Inhibitory Activity
pH
7.5±n/a
Temperature
298.15±n/a K
IC50
>100000±n/a nM
Comments
extracted
Citation
 Matsumoto, SHattori, YToyofuku, MMorimoto, SDaini, MKojima, TKaku, TIto, M Cyclopropanamine compound and use thereof US Patent  US10053456 Publication Date 8/21/2018 
Target
Name:
Amine oxidase [flavin-containing] B
Synonyms:
AOFB_HUMAN MAOB Monoamine oxidase type B (MAO B) Monoamine oxidase type B (MAOB)
Type:
Protein
Mol. Mass.:
58768.76
Organism:
Homo sapiens (Human)
Description:
P27338
Residue:
520
  
Inhibitor
Name:
BDBM256656
Synonyms:
US10053456, 35 US10968213, Example 35 US9718814, 35 | US9920047, 35
Type:
Small organic molecule
Emp. Form.:
C17H23F2N3OS
Mol. Mass.:
355.446
SMILES:
FC1(F)CCC(CC1)NC(=O)c1nc(cs1)C1CC1NCC1CC1
: