Target
Lysine-specific histone demethylase 1A
Ligand
BDBM256661
Substrate
Meas. Tech.
LSD1 Inhibitory Activity
pH
8±n/a
Temperature
298.15±n/a K
IC50
<100.0±n/a nM
Comments
extracted
Citation
 Matsumoto, SHattori, YToyofuku, MMorimoto, SDaini, MKojima, TKaku, TIto, M Cyclopropanamine compound and use thereof US Patent  US10053456 Publication Date 8/21/2018 
Target
Name:
Lysine-specific histone demethylase 1A
Synonyms:
AOF2 Flavin-containing amine oxidase domain-containing protein 2 KDM1A KIAA0601 Lysine-specific demethylase 1 (LSD1) Lysine-specific histone demethylase 1 (LSD1)
Type:
Enzyme
Mol. Mass.:
92901.01
Organism:
Homo sapiens (Human)
Description:
O60341
Residue:
852
  
Inhibitor
Name:
BDBM256661
Synonyms:
BDBM256662 US10414761, Example 41 US9487511, 40 US9920047, 41
Type:
Small organic molecule
Emp. Form.:
C17H22N4O2S2
Mol. Mass.:
378.512
SMILES:
Cc1nnc(NC(=O)c2csc(c2)C2CC2NCC2CCOCC2)s1
: