Target
Lysine-specific histone demethylase 1A
Ligand
BDBM256680
Substrate
Meas. Tech.
LSD1 Inhibitory Activity
pH
8±n/a
Temperature
298.15±n/a K
IC50
<100.0±n/a nM
Comments
extracted
Citation
 Matsumoto, SHattori, YToyofuku, MMorimoto, SDaini, MKojima, TKaku, TIto, M Cyclopropanamine compound and use thereof US Patent  US10053456 Publication Date 8/21/2018 
Target
Name:
Lysine-specific histone demethylase 1A
Synonyms:
AOF2 Flavin-containing amine oxidase domain-containing protein 2 KDM1A KIAA0601 Lysine-specific demethylase 1 (LSD1) Lysine-specific histone demethylase 1 (LSD1)
Type:
Enzyme
Mol. Mass.:
92901.01
Organism:
Homo sapiens (Human)
Description:
O60341
Residue:
852
  
Inhibitor
Name:
BDBM256680
Synonyms:
US10053456, 59 US10968213, Example 59 US9718814, 59 | US9920047, 59
Type:
Small organic molecule
Emp. Form.:
C19H25N5OS2
Mol. Mass.:
403.565
SMILES:
Cc1nnc(NC(=O)c2cc(cs2)C2CC2NC2CCN(CC2)C2CC2)s1
: