Target
ALK tyrosine kinase receptor [L1196M]
Ligand
BDBM243376
Substrate
IC50
<10.00±n/a nM
Citation
 Yun, CSKim, HRCho, SYJung, HJLee, KChae, CHLee, COPark, CHKim, PHwang, JYHa, JDAhn, SJ Pyrimidine-2,4-diamine derivative and anticancer pharmaceutical composition comprising same as effective ingredient US Patent  US10053458 Publication Date 8/21/2018 
Target
Name:
ALK tyrosine kinase receptor [L1196M]
Synonyms:
ALK ALK tyrosine kinase receptor (ALK) (L1196M) ALK tyrosine kinase receptor (L1196M) Anaplastic lymphoma kinase L1196M (ALK L1196M) | Tyrosine-protein kinase receptor [L1196M]
Type:
Mol. Mass.:
176471.13
Organism:
Homo sapiens (Human)
Description:
Q9UM73[L1196M]
Residue:
1620
  
Inhibitor
Name:
BDBM243376
Synonyms:
1-6-(5-chloro-4-(2-(isopropylsulfonyl)phenylamino)pyrimidin-2-yl)amino-7-methoxy-3,4-dihydroisoquinoline-2(1H)-yl-2-hydroxyethane-1-one | US10053458, 8
Type:
Small organic molecule
Emp. Form.:
C25H28ClN5O5S
Mol. Mass.:
546.038
SMILES:
COc1cc2CN(CCc2cc1Nc1ncc(Cl)c(Nc2ccccc2S(=O)(=O)C(C)C)n1)C(=O)CO
: