Target
ALK tyrosine kinase receptor
Ligand
BDBM243424
Substrate
Meas. Tech.
Inhibitory Activity Against Anaplastic Lymphoma Kinase (ALK)
Temperature
298.15±n/a K
IC50
<10.00±n/a nM
Comments
extracted
Citation
 Yun, CSKim, HRCho, SYJung, HJLee, KChae, CHLee, COPark, CHKim, PHwang, JYHa, JDAhn, SJ Pyrimidine-2,4-diamine derivative and anticancer pharmaceutical composition comprising same as effective ingredient US Patent  US10053458 Publication Date 8/21/2018 
Target
Name:
ALK tyrosine kinase receptor
Synonyms:
ALK ALK_HUMAN CD_antigen: CD246
Type:
Protein
Mol. Mass.:
176453.10
Organism:
Homo sapiens (Human)
Description:
Q9UM73
Residue:
1620
  
Inhibitor
Name:
BDBM243424
Synonyms:
7-(5-chloro-4-(2-(isopropylsulfonyl)phenylamino)pyrimidin-2-yl)amino)-6-methoxy-3,4-dihydroisoquinoline-2(1H)-sulfonamide | US10053458, 40
Type:
Small organic molecule
Emp. Form.:
C23H27ClN6O5S2
Mol. Mass.:
567.081
SMILES:
COc1cc2CCN(Cc2cc1Nc1ncc(Cl)c(Nc2ccccc2S(=O)(=O)C(C)C)n1)S(N)(=O)=O
: