Target
ALK tyrosine kinase receptor [L1196M]
Ligand
BDBM244034
Substrate
IC50
<10.00±n/a nM
Citation
 Yun, CSKim, HRCho, SYJung, HJLee, KChae, CHLee, COPark, CHKim, PHwang, JYHa, JDAhn, SJ Pyrimidine-2,4-diamine derivative and anticancer pharmaceutical composition comprising same as effective ingredient US Patent  US10053458 Publication Date 8/21/2018 
Target
Name:
ALK tyrosine kinase receptor [L1196M]
Synonyms:
ALK ALK tyrosine kinase receptor (ALK) (L1196M) ALK tyrosine kinase receptor (L1196M) Anaplastic lymphoma kinase L1196M (ALK L1196M) | Tyrosine-protein kinase receptor [L1196M]
Type:
Mol. Mass.:
176471.13
Organism:
Homo sapiens (Human)
Description:
Q9UM73[L1196M]
Residue:
1620
  
Inhibitor
Name:
BDBM244034
Synonyms:
5-chloro-N4-(2-(isopropylsulfonyl)phenyl)-N2-(2-ethyl-6-methoxy-4,4-trimethyl-1,2,3,4-tetrahydroisoquinolin-7-yl)pyrimidine-2,4-diamine | US10053458, 92
Type:
Small organic molecule
Emp. Form.:
C27H34ClN5O3S
Mol. Mass.:
544.109
SMILES:
CCN1Cc2cc(Nc3ncc(Cl)c(Nc4ccccc4S(=O)(=O)C(C)C)n3)c(OC)cc2C(C)(C)C1
: