Target
Nuclear factor NF-kappa-B p105 subunit
Ligand
BDBM367278
Substrate
Meas. Tech.
Electrophoretic Mobility Shift Assay (EMSA)
IC50
<500±n/a nM
Citation
 Ouk, SLiou, H Small molecule NF-κB inhibitors US Patent  US10226464 Publication Date 3/12/2019 
Target
Name:
Nuclear factor NF-kappa-B p105 subunit
Synonyms:
NFKB1 Nuclear factor NF-kappa-B (NF-kB) Nuclear factor NF-kappa-B p105 subunit
Type:
Protein
Mol. Mass.:
105329.57
Organism:
Homo sapiens (Human)
Description:
P19838
Residue:
968
  
Inhibitor
Name:
BDBM367278
Synonyms:
US10226464, Compound 45
Type:
Small organic molecule
Emp. Form.:
C15H13FN2O4
Mol. Mass.:
304.2731
SMILES:
CCCCOc1ccc2cc3c(nc(=O)[nH]c3=O)oc2c1F
: