Target
Nuclear factor NF-kappa-B p105 subunit
Ligand
BDBM367294
Substrate
Meas. Tech.
Electrophoretic Mobility Shift Assay (EMSA)
IC50
<1000±n/a nM
Citation
 Ouk, SLiou, H Small molecule NF-κB inhibitors US Patent  US10226464 Publication Date 3/12/2019 
Target
Name:
Nuclear factor NF-kappa-B p105 subunit
Synonyms:
NFKB1 Nuclear factor NF-kappa-B (NF-kB) Nuclear factor NF-kappa-B p105 subunit
Type:
Protein
Mol. Mass.:
105329.57
Organism:
Homo sapiens (Human)
Description:
P19838
Residue:
968
  
Inhibitor
Name:
BDBM367294
Synonyms:
US10226464, Compound 61
Type:
Small organic molecule
Emp. Form.:
C16H16N2O6
Mol. Mass.:
332.308
SMILES:
COCCOCCOc1ccc2cc3c(nc(=O)[nH]c3=O)oc2c1
: