Target
Metallo-beta-lactamase type 2
Ligand
BDBM368075
Substrate
Meas. Tech.
Enzyme Activity
IC50
0.080±n/a nM
Citation
 Bennett, FJiang, JPasternak, ADong, SGu, XScott, JDTang, HZhao, ZHuang, YHunter, DYang, DYoung, KXiao, LZhang, ZFu, JBai, YZheng, ZZhang, X Metallo-beta-lactamase inhibitors US Patent  US10227331 Publication Date 3/12/2019 
Target
Name:
Metallo-beta-lactamase type 2
Synonyms:
B2 metallo-beta-lactamase Beta-lactamase NDM-1 Metallo-beta-lactamase NDM-1 Metallo-beta-lactamase type II New Delhi metallo-beta-lactamase-1 | blaNDM-1
Type:
PROTEIN
Mol. Mass.:
28498.15
Organism:
Klebsiella pneumoniae
Description:
ChEMBL_103887
Residue:
270
  
Inhibitor
Name:
BDBM368075
Synonyms:
3-(2-amino-5-fluoro-1H- benzo[d]imidazol-7-yl)-6- (azetidin-3-ylsulfonyl)-2- (1H-tetrazol-5-yl) benzenesulfonamide US10227331, Example 296
Type:
Small organic molecule
Emp. Form.:
C17H16FN9O4S2
Mol. Mass.:
493.495
SMILES:
Nc1nc2cc(F)cc(-c3ccc(c(c3-c3nnn[nH]3)S(N)(=O)=O)S(=O)(=O)C3CNC3)c2[nH]1
: