Target
Nuclear receptor ROR-gamma
Ligand
BDBM189899
Substrate
Meas. Tech.
Assay of Co-Activator Recruitment by TR-FRET
IC50
5.80±n/a nM
Citation
 Schnute, MEFlick, ACJones, PKaila, NMente, SRTrzupek, JDVazquez, MLWennerstal, GMXing, LZamaratski, EZhang, LUnwalla, RJ Methyl- and trifluoromethyl-substituted pyrrolopyridine modulators of RORC2 and methods of use therof US Patent  US10227346 Publication Date 3/12/2019 
Target
Name:
Nuclear receptor ROR-gamma
Synonyms:
NR1F3 Nuclear receptor ROR-gamma (RORC) RAR-related orphan receptor C (RORc) RORG RZRG Retinoid-related orphan receptor-gamma (RORc)
Type:
Enzyme Catalytic Domain
Mol. Mass.:
58218.40
Organism:
Homo sapiens (Human)
Description:
P51449
Residue:
518
  
Inhibitor
Name:
BDBM189899
Synonyms:
US10227346, Example 25 US9670201, 25 Rac-3-cyano-N-(3-(1-(2-cyclopropylpropanoyl)piperidin-4-yl)-1-methyl-4-(trifluoromethyl)-1H-pyrrolo[2,3-b]pyridin-5-yl)benzamide | US9920054, Example 25
Type:
Small organic molecule
Emp. Form.:
C28H28F3N5O2
Mol. Mass.:
523.5494
SMILES:
CC(C1CC1)C(=O)N1CCC(CC1)c1cn(C)c2ncc(NC(=O)c3cccc(c3)C#N)c(c12)C(F)(F)F
: