Target
Mitogen-activated protein kinase kinase kinase 8
Ligand
BDBM21939
Substrate
Dual specificity mitogen-activated protein kinase kinase 1
Meas. Tech.
Tpl2/Cot Kinase Assay
IC50
43±n/a nM
Citation
 Green, NHu, YJanz, KLi, HQKaila, NGuler, SThomason, JJoseph-McCarthy, DTam, SYHotchandani, RWu, JHuang, AWang, QLeung, LPelker, JMarusic, SHsu, STelliez, JBHall, JPCuozzo, JWLin, LL Inhibitors of tumor progression loci-2 (Tpl2) kinase and tumor necrosis factor alpha (TNF-alpha) production: selectivity and in vivo antiinflammatory activity of novel 8-substituted-4-anilino-6-aminoquinoline-3-carbonitriles. J Med Chem 50:4728-45 (2007)  
Target
Name:
Mitogen-activated protein kinase kinase kinase 8
Synonyms:
C-COT COT proto-oncogene serine/threonine-protein kinase ESTF MAP3K8 Tumor Progression Loci-2 Kinase (COT) | Tumor progression locus 2
Type:
Serine/threonine-protein kinase
Mol. Mass.:
52916.89
Organism:
Homo sapiens (Human)
Description:
P41279
Residue:
467
  
Inhibitor
Name:
BDBM21939
Synonyms:
8-bromo-4-[(3-chloro-4-fluorophenyl)amino]-6-({[1-(2-methanesulfonylethyl)-1H-imidazol-4-yl]methyl}amino)quinoline-3-carbonitrile | Cyanoquinoline, 50
Type:
Small organic molecule
Emp. Form.:
C23H19BrClFN6O2S
Mol. Mass.:
577.856
SMILES:
CS(=O)(=O)CCn1cnc(CNc2cc(Br)c3ncc(C#N)c(Nc4ccc(F)c(Cl)c4)c3c2)c1
:
Substrate
Name:
Dual specificity mitogen-activated protein kinase kinase 1
Synonyms:
GST fusion of MAP kinase kinase 1 MAP2K1 MP2K1_RABIT glutathione S-transferase-MAP kinase kinase 1
Type:
Other Protein Type
Mol. Mass.:
43453
Organism:
Oryctolagus cuniculus (rabbit)
Description:
Rabbit MEK1 was purchased from Millipore.
Residue:
393