Target
Tyrosine-protein kinase Lck
Ligand
BDBM340160
Substrate
Meas. Tech.
Lck Enzyme Activity
EC50
550±n/a nM
Citation
 Barf, TAJans, CGde Man, APOubrie, AARaaijmakers, HCRewinkel, JBSterrenburg, JGWijkmans, JC 4-imidazopyridazin-1-yl-benzamides as BTK inhibitors US Patent  US10239883 Publication Date 3/26/2019 
Target
Name:
Tyrosine-protein kinase Lck
Synonyms:
2.7.10.2 LCK_HUMAN Leukocyte C-terminal Src kinase Lymphocyte-specific protein tyrosine kinase Protein YT16 Proto-oncogene tyrosine-protein kinase LCK T cell-specific protein-tyrosine kinase
Type:
Mol. Mass.:
57987.83
Organism:
Homo sapiens (Human)
Description:
P06239
Residue:
509
  
Inhibitor
Name:
BDBM340160
Synonyms:
(S)-4-(3-(1-acryloylpyrrolidin-2-yl)- 8-aminoimidazo[1,5-a]pyrazin-1-yl)- N-(4-(trifluoromethyl)pyridin-2- yl)benzamide US10934296, Example 62 | US9758524, Example 62
Type:
Small organic molecule
Emp. Form.:
C26H22F3N7O2
Mol. Mass.:
521.4938
SMILES:
Nc1nccn2c(nc(-c3ccc(cc3)C(=O)Nc3cc(ccn3)C(F)(F)F)c12)[C@@H]1CCCN1C(=O)C=C
: