Target
Sphingosine 1-phosphate receptor 3
Ligand
BDBM22224
Substrate
BDBM10852
Meas. Tech.
Ligand-Induced Uptake of [35S]-GTP-gamma-S
pH
7.4±n/a
Temperature
295.15±n/a K
EC50
400±n/a nM
Citation
 Yan, LHuo, PHale, JJMills, SGHajdu, RKeohane, CARosenbach, MJMilligan, JAShei, GJChrebet, GBergstrom, JCard, DMandala, SM SAR studies of 3-arylpropionic acids as potent and selective agonists of sphingosine-1-phosphate receptor-1 (S1P1) with enhanced pharmacokinetic properties. Bioorg Med Chem Lett 17:828-31 (2007)  
Target
Name:
Sphingosine 1-phosphate receptor 3
Synonyms:
C9orf108 EDG3 S1P receptor 3 S1P3 S1PR3_HUMAN Sphingosine 1-phosphate receptor 3 (S1P3) | Sphingosine 1-phosphate receptor Edg-3
Type:
G Protein-Coupled Receptor (GPCR)
Mol. Mass.:
42278.13
Organism:
Homo sapiens (Human)
Description:
Q99500
Residue:
378
  
Inhibitor
Name:
BDBM22224
Synonyms:
2-methyl-3-(3-methyl-4-{5-[4-(propan-2-yloxy)-3-(trifluoromethyl)phenyl]-1,2,4-oxadiazol-3-yl}phenyl)propanoic acid | 3-arylpropionic acid derivative, 7a
Type:
Small organic molecule
Emp. Form.:
C23H23F3N2O4
Mol. Mass.:
448.4349
SMILES:
CC(C)Oc1ccc(cc1C(F)(F)F)-c1nc(no1)-c1ccc(CC(C)C(O)=O)cc1C
:
Substrate