Target
Gag-Pol polyprotein
Ligand
BDBM372417
Substrate
Meas. Tech.
HIV Cell Culture Assay
EC50
2.00±n/a nM
Citation
 Sit, SChen, YChen, JSwidorski, JVenables, BLSin, NMeanwell, NARegueiro-Ren, AHartz, RAXu, LLiu, Z Triterpenoids with HIV maturation inhibitory activity US Patent  US10245275 Publication Date 4/2/2019 
Target
Name:
Gag-Pol polyprotein
Synonyms:
Capsid protein p24 HIV-1 integrase (IN) WT Reverse transcriptase (HIV-1 RT) | gag-pol
Type:
Protein
Mol. Mass.:
161820.05
Organism:
Human immunodeficiency virus type 1 group M subtype B (isolate NY5) (HIV-1)
Description:
P12497
Residue:
1435
  
Inhibitor
Name:
BDBM372417
Synonyms:
US10245275, Compound B
Type:
Small organic molecule
Emp. Form.:
C43H68N2O4S
Mol. Mass.:
709.076
SMILES:
CC(=C)[C@@H]1CC[C@@]2(CC[C@]3(C)[C@H](CC[C@@H]4[C@@]5(C)CC=C(C6=CCC(C)(CC6)OC=O)C(C)(C)[C@@H]5CC[C@@]34C)[C@@H]12)NCCN1CCS(=O)(=O)CC1
: