Target
Lysine-specific demethylase 5B
Ligand
BDBM264008
Substrate
Meas. Tech.
In Vitro Enzyme Inhibition Assay
IC50
<100±n/a nM
Citation
 Nie, ZStafford, JAVeal, JMWallace, MB Histone demethylase inhibitors US Patent  US9908865 Publication Date 3/6/2018 
Target
Name:
Lysine-specific demethylase 5B
Synonyms:
CT31 Histone demethylase JARID1B Jumonji/ARID domain-containing protein 1B KDM5B_HUMAN Lysine-specific demethylase 5B (KDM5Flag-5B-FL) PLU1 RBP2-H1 | Retinoblastoma-binding protein 2 homolog 1
Type:
Protein
Mol. Mass.:
175659.67
Organism:
Homo sapiens (Human)
Description:
Q9UGL1
Residue:
1544
  
Inhibitor
Name:
BDBM264008
Synonyms:
2-[5-[(2,4- difluorophenyl)methoxy]pyrazol- 1-yl]pyridine-4-carboxylic acid US9604961, Example 86 US9908865, Example 86
Type:
Small organic molecule
Emp. Form.:
C16H11F2N3O3
Mol. Mass.:
331.2736
SMILES:
OC(=O)c1ccnc(c1)-n1nccc1OCc1ccc(F)cc1F
: