Target
Lysine-specific demethylase 5B
Ligand
BDBM264025
Substrate
Meas. Tech.
In Vitro Enzyme Inhibition Assay
IC50
<100±n/a nM
Citation
 Nie, ZStafford, JAVeal, JMWallace, MB Histone demethylase inhibitors US Patent  US9908865 Publication Date 3/6/2018 
Target
Name:
Lysine-specific demethylase 5B
Synonyms:
CT31 Histone demethylase JARID1B Jumonji/ARID domain-containing protein 1B KDM5B_HUMAN Lysine-specific demethylase 5B (KDM5Flag-5B-FL) PLU1 RBP2-H1 | Retinoblastoma-binding protein 2 homolog 1
Type:
Protein
Mol. Mass.:
175659.67
Organism:
Homo sapiens (Human)
Description:
Q9UGL1
Residue:
1544
  
Inhibitor
Name:
BDBM264025
Synonyms:
2-(4-[2-(dimethylamino)ethyl]- 5-[(4- fluorophenyl)methoxy]pyrazol-1- yl]pyridine-4-carboxylic acid US9714230, 110 | US9908865, Example 110
Type:
Small organic molecule
Emp. Form.:
C20H21FN4O3
Mol. Mass.:
384.4041
SMILES:
CN(C)CCc1cnn(c1OCc1ccc(F)cc1)-c1cc(ccn1)C(O)=O
: