Target
Lysine-specific demethylase 5B
Ligand
BDBM375615
Substrate
Meas. Tech.
In Vitro Enzyme Inhibition Assay
IC50
<100±n/a nM
Citation
 Nie, ZStafford, JAVeal, JMWallace, MB Histone demethylase inhibitors US Patent  US9908865 Publication Date 3/6/2018 
Target
Name:
Lysine-specific demethylase 5B
Synonyms:
CT31 Histone demethylase JARID1B Jumonji/ARID domain-containing protein 1B KDM5B_HUMAN Lysine-specific demethylase 5B (KDM5Flag-5B-FL) PLU1 RBP2-H1 | Retinoblastoma-binding protein 2 homolog 1
Type:
Protein
Mol. Mass.:
175659.67
Organism:
Homo sapiens (Human)
Description:
Q9UGL1
Residue:
1544
  
Inhibitor
Name:
BDBM375615
Synonyms:
N-cyano-2-[4-[2-[(4- fluorophenyl)methyl- methylamino]ethyl]pyrazol-1- yl]pyridine-4-carboxamide | US9908865, Example 157
Type:
Small organic molecule
Emp. Form.:
C20H19FN6O
Mol. Mass.:
378.4029
SMILES:
CN(CCc1cnn(c1)-c1cc(ccn1)C(=O)NC#N)Cc1ccc(F)cc1
: