Target
Rho-associated protein kinase 2
Ligand
BDBM376483
Substrate
Meas. Tech.
In Vitro Assay
IC50
1.29±n/a nM
Citation
 Quan, MLHu, ZWang, CPatil, S Tricyclic pyrido-carboxamide derivatives as rock inhibitors US Patent  US9914740 Publication Date 3/13/2018 
Target
Name:
Rho-associated protein kinase 2
Synonyms:
KIAA0619 ROCK2 Rho kinase 2 (ROCKII) Rho-associated protein kinase 2 (ROCK2) Rho-associated protein kinase 2/Transforming protein RhoA Rho-associated, coiled-coil-containing protein kinase II p164 ROCK-2
Type:
Protein
Mol. Mass.:
160885.43
Organism:
Homo sapiens (Human)
Description:
O75116
Residue:
1388
  
Inhibitor
Name:
BDBM376483
Synonyms:
(R)-N-(1-(3- methoxyphenyl)ethyl)-9H- pyrido[3,4-b]indole-7- carboxamide | US9914740, XIV-4
Type:
Small organic molecule
Emp. Form.:
C21H19N3O2
Mol. Mass.:
345.3945
SMILES:
COc1cccc(c1)[C@@H](C)NC(=O)c1ccc2c(c1)[nH]c1cnccc21
: