Target
Lysine-specific histone demethylase 1A
Ligand
BDBM243427
Substrate
Meas. Tech.
Inhibition Assay
IC50
<100.0±n/a nM
Citation
 Matsumoto, SHattori, YToyofuku, MMorimoto, SDaini, MKojima, TKaku, TIto, M Cyclopropanamine compound and use thereof US Patent  US9920047 Publication Date 3/20/2018 
Target
Name:
Lysine-specific histone demethylase 1A
Synonyms:
AOF2 Flavin-containing amine oxidase domain-containing protein 2 KDM1A KIAA0601 Lysine-specific demethylase 1 (LSD1) Lysine-specific histone demethylase 1 (LSD1)
Type:
Enzyme
Mol. Mass.:
92901.01
Organism:
Homo sapiens (Human)
Description:
O60341
Residue:
852
  
Inhibitor
Name:
BDBM243427
Synonyms:
4-(trans-2- (cyclobutylamino)- cyclopropyl)-N-(1- methyl-1H-pyrazol-4- yl)thiophene-2- carboxamide US10414761, Example 61 US9718814, 61 | US9920047, 61
Type:
Small organic molecule
Emp. Form.:
C16H20N4OS
Mol. Mass.:
316.421
SMILES:
Cn1cc(NC(=O)c2cc(cs2)C2CC2NC2CCC2)cn1
: