Target
Amine oxidase [flavin-containing] A
Ligand
BDBM376935
Substrate
Meas. Tech.
Inhibition Assay
IC50
25000±n/a nM
Citation
 Matsumoto, SHattori, YToyofuku, MMorimoto, SDaini, MKojima, TKaku, TIto, M Cyclopropanamine compound and use thereof US Patent  US9920047 Publication Date 3/20/2018 
Target
Name:
Amine oxidase [flavin-containing] A
Synonyms:
AOFA_HUMAN MAO-A Monoamine oxidase Monoamine oxidase type A (MAO A) Monoamine oxidase type A (MAOA)
Type:
Protein
Mol. Mass.:
59689.53
Organism:
Homo sapiens (Human)
Description:
P21397
Residue:
527
  
Inhibitor
Name:
BDBM376935
Synonyms:
US9920047, 65
Type:
Small organic molecule
Emp. Form.:
C19H26F2N2OS
Mol. Mass.:
368.484
SMILES:
Cc1sc(cc1C(=O)NC1CCC(F)(F)CC1)[C@@H]1C[C@H]1NCC1CC1
: