Target
Bile acid receptor
Ligand
BDBM379467
Substrate
Meas. Tech.
Human FXR (NR1H4) Assay
EC50
550±n/a nM
Citation
 Or, YSWang, GShen, RXing, X Bile acid analogs as FXR/TGR5 agonists and methods of use thereof US Patent  US10266560 Publication Date 4/23/2019 
Target
Name:
Bile acid receptor
Synonyms:
BAR FXR HRR1 NR1H4_HUMAN RIP14 Retinoid X receptor-interacting protein 14 | farnesoid x receptor
Type:
Nuclear Receptor
Mol. Mass.:
55916.24
Organism:
Homo sapiens (Human)
Description:
Q96RI1
Residue:
486
  
Inhibitor
Name:
BDBM379467
Synonyms:
US10266560, Example 4
Type:
Small organic molecule
Emp. Form.:
C29H51NO5S
Mol. Mass.:
525.784
SMILES:
CCCCS(=O)(=O)NC(=O)CC(C)[C@H]1CC[C@H]2[C@@H]3[C@H](O)[C@H](CC)[C@@H]4C[C@H](O)CC[C@]4(C)[C@H]3CC[C@]12C
: