Target
Bile acid receptor
Ligand
BDBM379528
Substrate
Meas. Tech.
Human FXR (NR1H4) Assay
EC50
<100±n/a nM
Citation
 Or, YSWang, GShen, RXing, X Bile acid analogs as FXR/TGR5 agonists and methods of use thereof US Patent  US10266560 Publication Date 4/23/2019 
Target
Name:
Bile acid receptor
Synonyms:
BAR FXR HRR1 NR1H4_HUMAN RIP14 Retinoid X receptor-interacting protein 14 | farnesoid x receptor
Type:
Nuclear Receptor
Mol. Mass.:
55916.24
Organism:
Homo sapiens (Human)
Description:
Q96RI1
Residue:
486
  
Inhibitor
Name:
BDBM379528
Synonyms:
US10266560, Example 487
Type:
Small organic molecule
Emp. Form.:
C34H50F3NO6S
Mol. Mass.:
657.824
SMILES:
CC[C@H]1[C@@H](O)[C@H]2[C@@H]3CC[C@H]([C@H](C)C[C@@H](C)C(=O)NS(=O)(=O)c4ccc(OC(F)(F)F)cc4)[C@@]3(C)CC[C@@H]2[C@@]2(C)CC[C@@H](O)C[C@@H]12
: