Target
Dihydroorotate dehydrogenase (quinone), mitochondrial
Ligand
BDBM24404
Substrate
BDBM15346
Meas. Tech.
DHODH Inhibition Assay
pH
8±n/a
Temperature
293.15±n/a K
IC50
3000±840 nM
Citation
 Phillips, MAGujjar, RMalmquist, NAWhite, JEl Mazouni, FBaldwin, JRathod, PK Triazolopyrimidine-based dihydroorotate dehydrogenase inhibitors with potent and selective activity against the malaria parasite Plasmodium falciparum. J Med Chem 51:3649-53 (2008)  
Target
Name:
Dihydroorotate dehydrogenase (quinone), mitochondrial
Synonyms:
DHOdehase Dihydroorotate dehydrogenase homolog PYRD_PLAF7
Type:
Enzyme
Mol. Mass.:
65581.88
Organism:
Plasmodium falciparum (isolate 3D7)
Description:
Q08210
Residue:
569
  
Inhibitor
Name:
BDBM24404
Synonyms:
N,5-dimethyl-N-(naphthalen-2-yl)-[1,2,4]triazolo[1,5-a]pyrimidin-7-amine | Triazolopyrimidine-Based Compound, 11
Type:
Small organic molecule
Emp. Form.:
C17H15N5
Mol. Mass.:
289.3345
SMILES:
CN(c1ccc2ccccc2c1)c1cc(C)nc2ncnn12
:
Substrate
Name:
BDBM15346
Synonyms:
2,3-dimethoxy-5-methyl-cyclohexa-2,5-diene-1,4-dione Ubiquinone-0 (CoQ0)
Type:
Small organic molecule
Emp. Form.:
C9H10O4
Mol. Mass.:
182.1733
SMILES:
COC1=C(OC)C(=O)C(C)=CC1=O
: