Target
Prostaglandin E2 receptor EP4 subtype
Ligand
BDBM261749
Substrate
Meas. Tech.
Test for Antagonism
Temperature
298.15±n/a K
IC50
3100±n/a nM
Comments
extracted
Citation
 Peters, OBräuer, NBlume, TTer Laak, AZorn, LNagel, JKaulfuss, SLanger, GKuhnke, J Benzimidazole derivatives as EP4 antagonists US Patent  US9708311 Publication Date 7/18/2017 
Target
Name:
Prostaglandin E2 receptor EP4 subtype
Synonyms:
PE2R4_HUMAN PGE2 receptor EP4 subtype PTGER4 Prostanoid EP4 receptor
Type:
Enzyme
Mol. Mass.:
53134.53
Organism:
Homo sapiens (Human)
Description:
P35408
Residue:
488
  
Inhibitor
Name:
BDBM261749
Synonyms:
Methyl 1-allyl-2-(9-ethyl-9H-carbazol-3-yl)-1H-benzimidazole-5-carboxylate | US9708311, 1
Type:
Small organic molecule
Emp. Form.:
C26H23N3O2
Mol. Mass.:
409.4797
SMILES:
CCn1c2ccccc2c2cc(ccc12)-c1nc2cc(ccc2n1CC=C)C(=O)OC
: