Target
Prostaglandin E2 receptor EP4 subtype
Ligand
BDBM261780
Substrate
Meas. Tech.
Test for Antagonism
Temperature
298.15±n/a K
IC50
42.8±n/a nM
Comments
extracted
Citation
 Peters, OBräuer, NBlume, TTer Laak, AZorn, LNagel, JKaulfuss, SLanger, GKuhnke, J Benzimidazole derivatives as EP4 antagonists US Patent  US9708311 Publication Date 7/18/2017 
Target
Name:
Prostaglandin E2 receptor EP4 subtype
Synonyms:
PE2R4_HUMAN PGE2 receptor EP4 subtype PTGER4 Prostanoid EP4 receptor
Type:
Enzyme
Mol. Mass.:
53134.53
Organism:
Homo sapiens (Human)
Description:
P35408
Residue:
488
  
Inhibitor
Name:
BDBM261780
Synonyms:
2-(9-Ethyl-9H-carbazol-3-yl)-N,1-bis(2-methoxyethyl)-1H-benzimidazole-5-carboxamide | US9708311, 31
Type:
Small organic molecule
Emp. Form.:
C28H30N4O3
Mol. Mass.:
470.5628
SMILES:
CCn1c2ccccc2c2cc(ccc12)-c1nc2cc(ccc2n1CCOC)C(=O)NCCOC
: