Target
Prostaglandin E2 receptor EP4 subtype
Ligand
BDBM261820
Substrate
Meas. Tech.
Test for Antagonism
Temperature
298.15±n/a K
IC50
872±n/a nM
Comments
extracted
Citation
 Peters, OBräuer, NBlume, TTer Laak, AZorn, LNagel, JKaulfuss, SLanger, GKuhnke, J Benzimidazole derivatives as EP4 antagonists US Patent  US9708311 Publication Date 7/18/2017 
Target
Name:
Prostaglandin E2 receptor EP4 subtype
Synonyms:
PE2R4_HUMAN PGE2 receptor EP4 subtype PTGER4 Prostanoid EP4 receptor
Type:
Enzyme
Mol. Mass.:
53134.53
Organism:
Homo sapiens (Human)
Description:
P35408
Residue:
488
  
Inhibitor
Name:
BDBM261820
Synonyms:
Ethyl-1-[2-(dimethylamino)ethyl]-2-(9-ethyl-9H-carbazol-3-yl)-1H-benzimidazole-5-carboxylate | US9708311, 71
Type:
Small organic molecule
Emp. Form.:
C28H30N4O2
Mol. Mass.:
454.5634
SMILES:
CCOC(=O)c1ccc2n(CCN(C)C)c(nc2c1)-c1ccc2n(CC)c3ccccc3c2c1
: