Target
Prostaglandin E2 receptor EP4 subtype
Ligand
BDBM261876
Substrate
Meas. Tech.
Test for Antagonism
Temperature
298.15±n/a K
IC50
257±n/a nM
Comments
extracted
Citation
 Peters, OBräuer, NBlume, TTer Laak, AZorn, LNagel, JKaulfuss, SLanger, GKuhnke, J Benzimidazole derivatives as EP4 antagonists US Patent  US9708311 Publication Date 7/18/2017 
Target
Name:
Prostaglandin E2 receptor EP4 subtype
Synonyms:
PE2R4_HUMAN PGE2 receptor EP4 subtype PTGER4 Prostanoid EP4 receptor
Type:
Enzyme
Mol. Mass.:
53134.53
Organism:
Homo sapiens (Human)
Description:
P35408
Residue:
488
  
Inhibitor
Name:
BDBM261876
Synonyms:
2-[9-(Cyclobutylmethyl)-9H-carbazol-3-yl]-1-(cyclopropylmethyl)-1H-benzimidazole-5-carboxylic acid | US9708311, 125
Type:
Small organic molecule
Emp. Form.:
C29H27N3O2
Mol. Mass.:
449.5436
SMILES:
OC(=O)c1ccc2n(CC3CC3)c(nc2c1)-c1ccc2n(CC3CCC3)c3ccccc3c2c1
: