Target
Prostaglandin E2 receptor EP4 subtype
Ligand
BDBM261877
Substrate
Meas. Tech.
Test for Antagonism
Temperature
298.15±n/a K
IC50
118±n/a nM
Comments
extracted
Citation
 Peters, OBräuer, NBlume, TTer Laak, AZorn, LNagel, JKaulfuss, SLanger, GKuhnke, J Benzimidazole derivatives as EP4 antagonists US Patent  US9708311 Publication Date 7/18/2017 
Target
Name:
Prostaglandin E2 receptor EP4 subtype
Synonyms:
PE2R4_HUMAN PGE2 receptor EP4 subtype PTGER4 Prostanoid EP4 receptor
Type:
Enzyme
Mol. Mass.:
53134.53
Organism:
Homo sapiens (Human)
Description:
P35408
Residue:
488
  
Inhibitor
Name:
BDBM261877
Synonyms:
5-{1-[2-(Dimethylamino)ethyl]-2-(9-ethyl-9H-carbazol-3-yl)-1H-benzimidazol-5-yl}-1,3,4-oxadiazol-2(3H)-one | US9708311, 126
Type:
Small organic molecule
Emp. Form.:
C27H26N6O2
Mol. Mass.:
466.5343
SMILES:
CCn1c2ccccc2c2cc(ccc12)-c1nc2cc(ccc2n1CCN(C)C)-c1n[nH]c(=O)o1
: