Target
Tyrosine-protein phosphatase non-receptor type 11 [205-593]
Ligand
BDBM24541
Substrate
BDBM13432
Meas. Tech.
Phosphatase Activity Assay
pH
7±n/a
Temperature
295.15±n/a K
IC50
1300±900 nM
Citation
 Lawrence, HRPireddu, RChen, LLuo, YSung, SSSzymanski, AMYip, MLGuida, WCSebti, SMWu, JLawrence, NJ Inhibitors of Src homology-2 domain containing protein tyrosine phosphatase-2 (Shp2) based on oxindole scaffolds. J Med Chem 51:4948-56 (2008)  
Target
Name:
Tyrosine-protein phosphatase non-receptor type 11 [205-593]
Synonyms:
PTN11_HUMAN PTP-2C PTPN11 SH-PTP3 Shp2
Type:
Protein phosphatase
Mol. Mass.:
44924.47
Organism:
Homo sapiens (Human)
Description:
Human recombinant GST-fusion SHP-2 (205-593).
Residue:
389
  
Inhibitor
Name:
BDBM24541
Synonyms:
4-{2-[(3Z)-5-(benzylsulfamoyl)-2-oxo-2,3-dihydro-1H-indol-3-ylidene]hydrazin-1-yl}benzoic acid | Oxindole scaffold, 10f
Type:
Emp. Form.:
C22H18N4O5S
Mol. Mass.:
450.467
SMILES:
OC(=O)c1ccc(NN=C2C(=O)Nc3ccc(cc23)S(=O)(=O)NCc2ccccc2)cc1
:
Substrate
Name:
BDBM13432
Synonyms:
6,8-difluoro-4-methylumbelliferyl phosphate [(6,8-difluoro-4-methyl-2-oxo-2H-chromen-7-yl)oxy]phosphonic acid
Type:
Small organic molecule
Emp. Form.:
C10H7F2O6P
Mol. Mass.:
292.1295
SMILES:
Cc1cc(=O)oc2c(F)c(OP(O)(O)=O)c(F)cc12
: