Target
Tyrosine-protein phosphatase non-receptor type 6 [205-595]
Ligand
BDBM24550
Substrate
BDBM13432
Meas. Tech.
Phosphatase Activity Assay
IC50
122800±n/a nM
Citation
 Lawrence, HRPireddu, RChen, LLuo, YSung, SSSzymanski, AMYip, MLGuida, WCSebti, SMWu, JLawrence, NJ Inhibitors of Src homology-2 domain containing protein tyrosine phosphatase-2 (Shp2) based on oxindole scaffolds. J Med Chem 51:4948-56 (2008)  
Target
Name:
Tyrosine-protein phosphatase non-receptor type 6 [205-595]
Synonyms:
HCP PTN6_HUMAN PTP1C Protein-Tyrosine Phosphatase SHP-1 SH-PTP1 | Tyrosine-protein phosphatase non-receptor type 6
Type:
Protein phosphatase
Mol. Mass.:
44886.26
Organism:
Homo sapiens (Human)
Description:
Human recombinant GST-fusion SHP-1 (205-595).
Residue:
391
  
Inhibitor
Name:
BDBM24550
Synonyms:
3-{2-[(3Z)-5-{[(3-chloro-4-fluorophenyl)methyl]sulfamoyl}-2-oxo-2,3-dihydro-1H-indol-3-ylidene]hydrazin-1-yl}benzoic acid | Oxindole scaffold, 10o
Type:
Small organic molecule
Emp. Form.:
C22H16ClFN4O5S
Mol. Mass.:
502.903
SMILES:
OC(=O)c1cccc(NN=C2C(=O)Nc3ccc(cc23)S(=O)(=O)NCc2ccc(F)c(Cl)c2)c1
:
Substrate
Name:
BDBM13432
Synonyms:
6,8-difluoro-4-methylumbelliferyl phosphate [(6,8-difluoro-4-methyl-2-oxo-2H-chromen-7-yl)oxy]phosphonic acid
Type:
Small organic molecule
Emp. Form.:
C10H7F2O6P
Mol. Mass.:
292.1295
SMILES:
Cc1cc(=O)oc2c(F)c(OP(O)(O)=O)c(F)cc12
: