Target
Toll-like receptor 7
Ligand
BDBM262094
Substrate
Meas. Tech.
HEK-Blue-hTLR7 assay
EC50
300±n/a nM
Citation
 Liang, CWang, JMiao, KYun, HZheng, X Sulfonimidoylpurinone compounds and derivatives for the treatment and prophylaxis of virus infection US Patent  US9708325 Publication Date 7/18/2017 
Target
Name:
Toll-like receptor 7
Synonyms:
ORF Names:UNQ248/PRO285 TLR7_HUMAN | Toll-like receptor 7 (TLR7)
Type:
Enzyme
Mol. Mass.:
120945.35
Organism:
Homo sapiens (Human)
Description:
Q9NYK1
Residue:
1049
  
Inhibitor
Name:
BDBM262094
Synonyms:
6-Amino-9-benzyl-2-(methylsulfonimidoyl)-7H-purin-8-one US11242345, Example 1 | US9708325, 1
Type:
Small organic molecule
Emp. Form.:
C13H14N6O2S
Mol. Mass.:
318.354
SMILES:
CS(=N)(=O)c1nc(N)c2[nH]c(=O)n(Cc3ccccc3)c2n1
: