Target
Toll-like receptor 7
Ligand
BDBM262111
Substrate
Meas. Tech.
HEK-Blue-hTLR7 assay
EC50
43.0±n/a nM
Citation
 Liang, CWang, JMiao, KYun, HZheng, X Sulfonimidoylpurinone compounds and derivatives for the treatment and prophylaxis of virus infection US Patent  US9708325 Publication Date 7/18/2017 
Target
Name:
Toll-like receptor 7
Synonyms:
ORF Names:UNQ248/PRO285 TLR7_HUMAN | Toll-like receptor 7 (TLR7)
Type:
Enzyme
Mol. Mass.:
120945.35
Organism:
Homo sapiens (Human)
Description:
Q9NYK1
Residue:
1049
  
Inhibitor
Name:
BDBM262111
Synonyms:
6-Amino-9-[(4-chlorophenyl)methyl]-2-(methylsulfonimidoyl)-7H-purin-8-one US9708325, 13
Type:
Small organic molecule
Emp. Form.:
C13H13ClN6O2S
Mol. Mass.:
352.799
SMILES:
CS(=N)(=O)c1nc(N)c2[nH]c(=O)n(Cc3ccc(Cl)cc3)c2n1
: