Target
Lysine-specific demethylase 2B
Ligand
BDBM383622
Substrate
Meas. Tech.
KDM2B TR-FRET Assay
IC50
41.4±n/a nM
Citation
 Albrecht, BKCote, AGehling, VHsiao-Wei Tsui, VKiefer, JRLiang, JMagnuson, SNasveschuk, CGPastor, RRomero, FATaylor, AMZhang, B Therapeutic compounds and uses thereof US Patent  US10280149 Publication Date 5/7/2019 
Target
Name:
Lysine-specific demethylase 2B
Synonyms:
AA 1-650 FBL10 Homo sapiens lysine demethylase 2B (KDM2B) KDM2B Lysine-specific demethylase 2B NDY1 PCCX2
Type:
Enzyme Catalytic Domain
Mol. Mass.:
152658.35
Organism:
Homo sapiens (Human)
Description:
Q8NHM5
Residue:
1336
  
Inhibitor
Name:
BDBM383622
Synonyms:
(1-(cyclopropylmethyl)-4-methylpiperidin-3-yl)(5-methoxynaphthalen-2-yl)methanone | US10280149, Example 136a
Type:
Small organic molecule
Emp. Form.:
C22H27NO2
Mol. Mass.:
337.4553
SMILES:
COc1cccc2cc(ccc12)C(=O)[C@H]1CN(CC2CC2)CC[C@H]1C
: