Target
Lysine-specific demethylase 2B
Ligand
BDBM383698
Substrate
Meas. Tech.
KDM2B TR-FRET Assay
IC50
77.4±n/a nM
Citation
 Albrecht, BKCote, AGehling, VHsiao-Wei Tsui, VKiefer, JRLiang, JMagnuson, SNasveschuk, CGPastor, RRomero, FATaylor, AMZhang, B Therapeutic compounds and uses thereof US Patent  US10280149 Publication Date 5/7/2019 
Target
Name:
Lysine-specific demethylase 2B
Synonyms:
AA 1-650 FBL10 Homo sapiens lysine demethylase 2B (KDM2B) KDM2B Lysine-specific demethylase 2B NDY1 PCCX2
Type:
Enzyme Catalytic Domain
Mol. Mass.:
152658.35
Organism:
Homo sapiens (Human)
Description:
Q8NHM5
Residue:
1336
  
Inhibitor
Name:
BDBM383698
Synonyms:
US10280149, Example 184a
Type:
Small organic molecule
Emp. Form.:
C26H32N2O2
Mol. Mass.:
404.5445
SMILES:
CCC[C@@H]1CCN(C[C@@H]1C(=O)c1ccc2c(CC#N)c(OC)ccc2c1)C1CCC1
: