Target
Metallo-beta-lactamase type 2
Ligand
BDBM262886
Substrate
Meas. Tech.
Class B Enzyme Assay
pH
7±n/a
IC50
6.82±n/a nM
Comments
extracted
Citation
 Mandal, MTang, HXiao, LSu, JLi, GYang, SPan, WTang, HDeJesus, RHicks, JLombardo, MChu, HHagmann, WPasternak, AGu, XJiang, JDong, SDing, FLondon, CBiswas, DYoung, KHunter, DNZhao, ZYang, D Metallo-beta-lactamase inhibitors US Patent  US9708336 Publication Date 7/18/2017 
Target
Name:
Metallo-beta-lactamase type 2
Synonyms:
B2 metallo-beta-lactamase BLAB_SERMA IMP-1 | Metallo-beta-lactamase type II
Type:
undefined
Mol. Mass.:
27125.88
Organism:
Serratia marcescens
Description:
P52699
Residue:
246
  
Inhibitor
Name:
BDBM262886
Synonyms:
3'-(3-hydroxypiperidin-1-yl)-2- (1H-tetrazol-5-yl)-4- (trifluoromethyl)biphenyl-3- sulfonamide | US9708336, 739
Type:
Small organic molecule
Emp. Form.:
C19H19F3N6O3S
Mol. Mass.:
468.453
SMILES:
NS(=O)(=O)c1c(ccc(-c2cccc(c2)N2CCCC(O)C2)c1-c1nnn[nH]1)C(F)(F)F
: