Target
Free fatty acid receptor 4
Ligand
BDBM384288
Substrate
Meas. Tech.
GPR120 pERK assay
EC50
370±n/a nM
Citation
 Shi, YCheng, PTWang, YJusuf, STao, SZhang, HWu, SCRobl, JA Cyclopropanecarboxylic acid GPR120 modulators US Patent  US9938222 Publication Date 4/10/2018 
Target
Name:
Free fatty acid receptor 4
Synonyms:
FFAR4 G-protein coupled receptor 120 G-protein coupled receptor GT01 GPR120 O3FAR1 PGR4
Type:
PROTEIN
Mol. Mass.:
42256.91
Organism:
Homo sapiens (Human)
Description:
ChEMBL_1508994
Residue:
377
  
Inhibitor
Name:
BDBM384288
Synonyms:
Trans-2-(((2′-fluoro-5′-isopropoxy-[1,1′-biphenyl]-4-yl)oxy)methyl) cyclopropanecarboxylic acid (racemate) | US9938222, Example 1
Type:
Small organic molecule
Emp. Form.:
C20H21FO4
Mol. Mass.:
344.3767
SMILES:
CC(C)Oc1ccc(F)c(c1)-c1ccc(OCC2CC2C(O)=O)cc1
: