Target
Free fatty acid receptor 4
Ligand
BDBM385715
Substrate
Meas. Tech.
GPR120 pERK assay
EC50
430±n/a nM
Citation
 Shi, YCheng, PTWang, YJusuf, STao, SZhang, HWu, SCRobl, JA Cyclopropanecarboxylic acid GPR120 modulators US Patent  US9938222 Publication Date 4/10/2018 
Target
Name:
Free fatty acid receptor 4
Synonyms:
FFAR4 G-protein coupled receptor 120 G-protein coupled receptor GT01 GPR120 O3FAR1 PGR4
Type:
PROTEIN
Mol. Mass.:
42256.91
Organism:
Homo sapiens (Human)
Description:
ChEMBL_1508994
Residue:
377
  
Inhibitor
Name:
BDBM385715
Synonyms:
Trans-2-(2-((2′-fluoro-5′-isopropoxy-[1,1′-biphenyl]-4-yl)methyl)cyclopropyl)acetic acid (racemate) US9938222, Example 34
Type:
Small organic molecule
Emp. Form.:
C21H23FO3
Mol. Mass.:
342.4039
SMILES:
CC(C)Oc1ccc(F)c(c1)-c1ccc(CC2CC2CC(O)=O)cc1
: