Target
Coagulation factor X
Ligand
BDBM387068
Substrate
Meas. Tech.
In Vitro Assay
Ki
<10±n/a nM
Citation
 Ding, ZLai, GChen, SYan, X Hydrazine compound as blood coagulation factor Xa inhibitor US Patent  US9938272 Publication Date 4/10/2018 
Target
Name:
Coagulation factor X
Synonyms:
Activated coagulation factor X (FXa) Coagulation factor X precursor F10 Factor X heavy chain Factor Xa Stuart-Prower factor
Type:
Enzyme
Mol. Mass.:
54726.60
Organism:
Homo sapiens (Human)
Description:
Residue:
488
  
Inhibitor
Name:
BDBM387068
Synonyms:
1-(4-Methoxyphenyl)-7-oxo-6-(2-oxo-[1,4′-bipiperidin]-1′-yl)-4,5,6,7-tetrahydro-1H-pyrazolo[3,4-c]pyridine-3-carboxamide | US9938272, Example 14
Type:
Small organic molecule
Emp. Form.:
C24H30N6O4
Mol. Mass.:
466.5328
SMILES:
COc1ccc(cc1)-n1nc(C(N)=O)c2CCN(N3CCC(CC3)N3CCCCC3=O)C(=O)c12
: