Target
Plasma kallikrein
Ligand
BDBM261344
Substrate
Meas. Tech.
Inhibitory Activity Assay
IC50
5.38±0 nM
Citation
 Davie, RLEdwards, HJEvans, DMHodgson, STMiller, INovak, ARSmith, AJStocks, MJ Heterocyclic derivates US Patent  US9533987 Publication Date 1/3/2017 
Target
Name:
Plasma kallikrein
Synonyms:
Fletcher factor KLKB1 Kallikrein Plasma kallikrein heavy chain Plasma prekallikrein
Type:
Protein
Mol. Mass.:
71391.16
Organism:
Homo sapiens (Human)
Description:
P03952
Residue:
638
  
Inhibitor
Name:
BDBM261344
Synonyms:
1-[4-(2-oxo-2h-pyridin-1-ylmethyl)-benzyl]-3-trifluoromethyl-1h-pyrazole-4-carboxylic acid (1h-pyrrolo[2,3-b]pyridin-5-ylmethyl)-amide | US9533987, example 7
Type:
Small organic molecule
Emp. Form.:
C26H21F3N6O2
Mol. Mass.:
506.4791
SMILES:
FC(F)(F)c1nn(Cc2ccc(Cn3ccccc3=O)cc2)cc1C(=O)NCc1cnc2[nH]ccc2c1
: