Target
Plasma kallikrein
Ligand
BDBM263320
Substrate
Kallikrein 1
Meas. Tech.
Inhibitory Activity Assay
IC50
2300±n/a nM
Citation
 Davie, RLEdwards, HJEvans, DMHodgson, STMiller, INovak, ARSmith, AJStocks, MJ Heterocyclic derivates US Patent  US9533987 Publication Date 1/3/2017 
Target
Name:
Plasma kallikrein
Synonyms:
Fletcher factor KLKB1 Kallikrein Plasma kallikrein heavy chain Plasma prekallikrein
Type:
Protein
Mol. Mass.:
71391.16
Organism:
Homo sapiens (Human)
Description:
P03952
Residue:
638
  
Inhibitor
Name:
BDBM263320
Synonyms:
1-[4-(pyridin-2-yloxy)-benzyl]-1h-pyrazole-4-carboxylic acid (1h-pyrrolo[2,3-b]pyridin-5-ylmethyl)-amide | US9533987, example 107
Type:
Small organic molecule
Emp. Form.:
C24H20N6O2
Mol. Mass.:
424.4546
SMILES:
O=C(NCc1cnc2[nH]ccc2c1)c1cnn(Cc2ccc(Oc3ccccn3)cc2)c1
:
Substrate
Name:
Kallikrein-1
Synonyms:
KLK1 Kallikrein 1 Kidney/pancreas/salivary gland kallikrein | Tissue kallikrein
Type:
Enzyme
Mol. Mass.:
28874.69
Organism:
Homo sapiens (Human)
Description:
P06870
Residue:
262