Target
Kallikrein-1
Ligand
BDBM263286
Substrate
Kallikrein 1
Meas. Tech.
Enzymatic Activity Assay
IC50
2790±n/a nM
Citation
 Davie, RLEdwards, HJEvans, DMHodgson, STMiller, INovak, ARSmith, AJStocks, MJ Heterocyclic derivates US Patent  US9533987 Publication Date 1/3/2017 
Target
Name:
Kallikrein-1
Synonyms:
KLK1 Kallikrein 1 Kidney/pancreas/salivary gland kallikrein | Tissue kallikrein
Type:
Enzyme
Mol. Mass.:
28874.69
Organism:
Homo sapiens (Human)
Description:
P06870
Residue:
262
  
Inhibitor
Name:
BDBM263286
Synonyms:
1-(2-pyrrolidin-1-yl-pyrimidin-5-ylmethyl)-3-trifluoromethyl-1h-pyrazole-4-carboxylic acid (1-amino-isoquinolin-6-ylmethyl)-amide | US9533987, example 64
Type:
Small organic molecule
Emp. Form.:
C24H23F3N8O
Mol. Mass.:
496.4876
SMILES:
Nc1nccc2cc(CNC(=O)c3cn(Cc4cnc(nc4)N4CCCC4)nc3C(F)(F)F)ccc12
:
Substrate
Name:
Kallikrein-1
Synonyms:
KLK1 Kallikrein 1 Kidney/pancreas/salivary gland kallikrein | Tissue kallikrein
Type:
Enzyme
Mol. Mass.:
28874.69
Organism:
Homo sapiens (Human)
Description:
P06870
Residue:
262