Target
Serine/threonine-protein kinase pim-1
Ligand
BDBM26629
Substrate
S6 kinase/Rsk-2 peptide 2
Meas. Tech.
Pim Kinase Assay
pH
7±n/a
Temperature
298.15±n/a K
IC50
280±130 nM
Citation
 Xia, ZKnaak, CMa, JBeharry, ZMMcInnes, CWang, WKraft, ASSmith, CD Synthesis and evaluation of novel inhibitors of Pim-1 and Pim-2 protein kinases. J Med Chem 52:74-86 (2009)  
Target
Name:
Serine/threonine-protein kinase pim-1
Synonyms:
PIM-1 Kinase PIM1_HUMAN Serine/threonine-protein kinase (PIM1) Serine/threonine-protein kinase PIM1 | Serine/threonine-protein kinase pim-1 (PIM1)
Type:
Protein
Mol. Mass.:
35681.82
Organism:
Homo sapiens (Human)
Description:
P11309
Residue:
313
  
Inhibitor
Name:
BDBM26629
Synonyms:
(5Z)-5-{[2-(2-methoxyethoxy)-3-(trifluoromethyl)phenyl]methylidene}-1,3-thiazolidine-2,4-dione | thiazolidine-2,4-dione, 7a
Type:
Small organic molecule
Emp. Form.:
C14H12F3NO4S
Mol. Mass.:
347.31
SMILES:
COCCOc1c(C=C2SC(O)=NC2=O)cccc1C(F)(F)F
:
Substrate
Name:
S6 kinase/Rsk-2 peptide 2
Synonyms:
Type:
Peptide
Mol. Mass.:
1149.41
Organism:
Description:
Residue:
9
KKRNRTLTK