Target
Tyrosine-protein kinase Blk
Ligand
BDBM13216
Substrate
Meas. Tech.
Kinase Screening Assay
IC50
<10.00±n/a nM
Citation
 Unciti-Broceta, AFraser, CO. Carragher, N Compounds US Patent  US10294227 Publication Date 5/21/2019 
Target
Name:
Tyrosine-protein kinase Blk
Synonyms:
B lymphoid tyrosine kinase BLK_HUMAN Tyrosine-protein kinase BLK (BLK) | p55-Blk
Type:
Protein
Mol. Mass.:
57711.88
Organism:
Homo sapiens (Human)
Description:
P51451
Residue:
505
  
Inhibitor
Name:
BDBM13216
Synonyms:
BMS-354825 DASATINIB N-(2-chloro-6-methylphenyl)-2-({6-[4-(2-hydroxyethyl)piperazin-1-yl]-2-methylpyrimidin-4-yl}amino)-1,3-thiazole-5-carboxamide US20230348453, Compound A8 med.21724, Compound Dasatinib
Type:
Small organic molecule
Emp. Form.:
C22H26ClN7O2S
Mol. Mass.:
488.006
SMILES:
Cc1nc(Nc2ncc(s2)C(=O)Nc2c(C)cccc2Cl)cc(n1)N1CCN(CCO)CC1
: