Target
Probable G-protein coupled receptor 139
Ligand
BDBM263493
Substrate
Meas. Tech.
Competition Binding
pH
7.4±n/a
Temperature
277.15±n/a K
Ki
26.0±n/a nM
Comments
extracted
Citation
 Hitchcock, SLam, BMonenschein, HReichard, H 4-oxo-3,4-dihydro-1,2,3-benzotriazine modulators of GPR139 US Patent  US9556130 Publication Date 1/31/2017 
Target
Name:
Probable G-protein coupled receptor 139
Synonyms:
G(q)-coupled orphan receptor GPRg1 G-protein-coupled receptor PGR3 GPR139 GPRG1 Probable G-protein coupled receptor 139
Type:
PROTEIN
Mol. Mass.:
40700.34
Organism:
Homo sapiens (Human)
Description:
ChEMBL_109920
Residue:
353
  
Inhibitor
Name:
BDBM263493
Synonyms:
(s)-2-(5-methoxy-4-oxobenzo[d][1,2,3]triazin-3 (4h)-yl)-n-(1-(4-(trifluoromethyl)phenyl)ethyl)acetamide US11173161, EX 61 | US9556130, test 61
Type:
Small organic molecule
Emp. Form.:
C19H17F3N4O3
Mol. Mass.:
406.3585
SMILES:
COc1cccc2nnn(CC(=O)N[C@@H](C)c3ccc(cc3)C(F)(F)F)c(=O)c12
: