Target
Fatty-acid amide hydrolase 1
Ligand
BDBM391656
Substrate
Meas. Tech.
[3H]-AEA Cellular Uptake
IC50
1590±n/a nM
Citation
 Reymond, JGertsch, JNicolussi, S Thiazolidinones as cellular anandamide uptake inhibitors and their use in the treatment of psychiatric or neurological disorders and inflammation, in particular neuroinflammation US Patent  US10300048 Publication Date 5/28/2019 
Target
Name:
Fatty-acid amide hydrolase 1
Synonyms:
Anandamide amidohydrolase FAAH FAAH1_HUMAN Fatty-acid amide hydrolase (FAAH) Oleamide hydrolase 1
Type:
Protein
Mol. Mass.:
63071.19
Organism:
Homo sapiens (Human)
Description:
O00519
Residue:
579
  
Inhibitor
Name:
BDBM391656
Synonyms:
US10300048, ETI-T-343
Type:
Small organic molecule
Emp. Form.:
C24H18F2N2O3S
Mol. Mass.:
452.473
SMILES:
COc1ccc(C=C2SC(=Nc3ccc(F)cc3)N(C2=O)c2ccc(F)cc2)cc1OC
: