Target
Serine/threonine-protein kinase PLK1
Ligand
BDBM28213
Substrate
PLK Substrate Peptide
Meas. Tech.
Scintillation Proximity Assay (SPA)
pH
7.2±n/a
Temperature
295.15±n/a K
IC50
7±n/a nM
Citation
 Emmitte, KAAdjebang, GMAndrews, CWAlberti, JGBambal, RChamberlain, SDDavis-Ward, RGDickson, HDHassler, DFHornberger, KRJackson, JRKuntz, KWLansing, TJMook, RANailor, KEPobanz, MASmith, SCSung, CMCheung, M Design of potent thiophene inhibitors of polo-like kinase 1 with improved solubility and reduced protein binding. Bioorg Med Chem Lett 19:1694-7 (2009)  
Target
Name:
Serine/threonine-protein kinase PLK1
Synonyms:
PLK PLK1 Polo-like kinase 1 (PlK1) STPK13 Serine/threonine-protein kinase 13 | polo-like kinase
Type:
Serine/threonine-protein kinase
Mol. Mass.:
68277.16
Organism:
Homo sapiens (Human)
Description:
P53350
Residue:
603
  
Inhibitor
Name:
BDBM28213
Synonyms:
5-{6-[(1-methylpiperidin-4-yl)methoxy]-1H-1,3-benzodiazol-1-yl}-3-[(1R)-1-[2-(trifluoromethyl)phenyl]ethoxy]thiophene-2-carboxamide | benzimidazole thiophene carboxamide, 21
Type:
Small organic molecule
Emp. Form.:
C28H29F3N4O3S
Mol. Mass.:
558.615
SMILES:
C[C@@H](Oc1cc(sc1C(N)=O)-n1cnc2ccc(OCC3CCN(C)CC3)cc12)c1ccccc1C(F)(F)F
:
Substrate
Name:
PLK Substrate Peptide
Synonyms:
Type:
Biotinylated peptide
Mol. Mass.:
1720.29
Organism:
Description:
Residue:
15
ITINAHSFNDTLDFD