Target
Androgen receptor
Ligand
BDBM391759
Substrate
Meas. Tech.
Antagonist Activity for AR
IC50
30.0±n/a nM
Citation
 Minamiguchi, KOkajima, SAoki, SAsai, MAsai, TYamanaka, HDohi, S Tetrahydropyridopyrimidine compound or salt thereof US Patent  US10300067 Publication Date 5/28/2019 
Target
Name:
Androgen receptor
Synonyms:
ANDR_HUMAN Androgen Receptor Androgen receptor/Baculoviral IAP repeat-containing protein 2 Dihydrotestosterone receptor Nuclear receptor subfamily 3 group C member 4
Type:
Receptor
Mol. Mass.:
99185.27
Organism:
Homo sapiens (Human)
Description:
CHO cells were stably transfected with human AR gene.
Residue:
920
  
Inhibitor
Name:
BDBM391759
Synonyms:
6-((7-(4-Cyano-3-(trifluoromethyl)phenyl)-5,6,7,8,-tetrahydropyrido[3,4-d]pyrimidin-4-yl)amino)-N-(2,2,2-trifluoroethyl)nicotinamide | US10300067, Example 11
Type:
Small organic molecule
Emp. Form.:
C23H17F6N7O
Mol. Mass.:
521.4178
SMILES:
FC(F)(F)CNC(=O)c1ccc(Nc2ncnc3CN(CCc23)c2ccc(C#N)c(c2)C(F)(F)F)nc1
: