Target
E3 ubiquitin-protein ligase XIAP [241-356]
Ligand
BDBM391813
Substrate
Meas. Tech.
Biological Assays
Ki
<25000±n/a nM
Citation
 Pache, LChanda, SKVamos, MDCosford, NDTeriete, PMarlett, JDiaz, AYoung, JA Use of inhibitor of apoptosis protein (IAP) antagonists in HIV therapy US Patent  US10300074 Publication Date 5/28/2019 
Target
Name:
E3 ubiquitin-protein ligase XIAP [241-356]
Synonyms:
API3 BIR3 domain IAP3 XIAP Bir3 amino acids 241-356 of XIAP
Type:
Enzyme Catalytic Domain
Mol. Mass.:
14548.06
Organism:
Homo sapiens (Human)
Description:
P98170[241-356]
Residue:
125
  
Inhibitor
Name:
BDBM391813
Synonyms:
US10300074, Compd 9 | US11111270, Compound 9
Type:
Small organic molecule
Emp. Form.:
C22H30N4O4
Mol. Mass.:
414.498
SMILES:
CN[C@@H](C)C(=O)N[C@H]1CO[C@H]2CCC(N2C1=O)C(=O)NC1CCCc2ccccc12
: