Target
Peroxisome proliferator-activated receptor alpha
Ligand
BDBM28668
Substrate
BDBM28680
Meas. Tech.
Radioligand Binding Assay
pH
7±n/a
Temperature
295.15±n/a K
IC50
6310±n/a nM
Citation
 Shearer, BGPatel, HSBillin, ANWay, JMWinegar, DALambert, MHXu, RXLeesnitzer, LMMerrihew, RVHuet, SWillson, TM Discovery of a novel class of PPARdelta partial agonists. Bioorg Med Chem Lett 18:5018-22 (2008)  
Target
Name:
Peroxisome proliferator-activated receptor alpha
Synonyms:
NR1C1 PPAR PPAR-alpha PPARA_HUMAN Peroxisome proliferator-activated receptor | Peroxisome proliferator-activated receptor alpha (PPAR alpha)
Type:
Enzyme
Mol. Mass.:
52222.08
Organism:
Homo sapiens (Human)
Description:
Q07869
Residue:
468
  
Inhibitor
Name:
BDBM28668
Synonyms:
5-fluoro-2-{[3-(1,2,3,4-tetrahydroisoquinoline-2-sulfonyl)benzene]amido}benzoic acid | Anthranilic acid deriv., 6
Type:
Small organic molecule
Emp. Form.:
C23H19FN2O5S
Mol. Mass.:
454.471
SMILES:
OC(=O)c1cc(F)ccc1NC(=O)c1cccc(c1)S(=O)(=O)N1CCc2ccccc2C1
:
Substrate
Name:
BDBM28680
Synonyms:
2-[4-(2-{[(2,4-difluorophenyl)carbamoyl](heptyl)amino}ethyl)phenoxy]-2-methylbutanoic acid GW 2331 | [3H]GW 2331
Type:
radiolabeled ligand
Emp. Form.:
C27H36F2N2O4
Mol. Mass.:
490.5825
SMILES:
CCCCCCCN(CCc1ccc(OC(C)(CC)C(O)=O)cc1)C(=O)Nc1ccc(F)cc1F
: