Target
Peroxisome proliferator-activated receptor alpha
Ligand
BDBM28676
Substrate
BDBM28680
Meas. Tech.
Radioligand Binding Assay (IC50) and Cell-Based Transcription Assay (EC50)
IC50
10000±n/a nM
Citation
 Shearer, BGPatel, HSBillin, ANWay, JMWinegar, DALambert, MHXu, RXLeesnitzer, LMMerrihew, RVHuet, SWillson, TM Discovery of a novel class of PPARdelta partial agonists. Bioorg Med Chem Lett 18:5018-22 (2008)  
Target
Name:
Peroxisome proliferator-activated receptor alpha
Synonyms:
NR1C1 PPAR PPAR-alpha PPARA_HUMAN Peroxisome proliferator-activated receptor | Peroxisome proliferator-activated receptor alpha (PPAR alpha)
Type:
Enzyme
Mol. Mass.:
52222.08
Organism:
Homo sapiens (Human)
Description:
Q07869
Residue:
468
  
Inhibitor
Name:
BDBM28676
Synonyms:
5-chloro-2-({3-[(6-methoxy-1,2,3,4-tetrahydroisoquinoline-2-)sulfonyl]benzene}amido)benzoic acid | Anthranilic acid deriv., 15
Type:
Small organic molecule
Emp. Form.:
C24H21ClN2O6S
Mol. Mass.:
500.951
SMILES:
COc1ccc2CN(CCc2c1)S(=O)(=O)c1cccc(c1)C(=O)Nc1ccc(Cl)cc1C(O)=O
:
Substrate
Name:
BDBM28680
Synonyms:
2-[4-(2-{[(2,4-difluorophenyl)carbamoyl](heptyl)amino}ethyl)phenoxy]-2-methylbutanoic acid GW 2331 | [3H]GW 2331
Type:
radiolabeled ligand
Emp. Form.:
C27H36F2N2O4
Mol. Mass.:
490.5825
SMILES:
CCCCCCCN(CCc1ccc(OC(C)(CC)C(O)=O)cc1)C(=O)Nc1ccc(F)cc1F
: